{"text_format":"1","workbook":"xlsx","n_sheets":3,"sheets":["lista do wyboru","Sheet1","wybrane produkty - podsumowanie"],"not_rendered":{"charts":0,"images":157,"macros":1,"external_links":0,"defined_names":1,"comments":0,"pivot_tables":0},"unopened":[],"bounds":{"document_bytes":16777216,"sheet_cells":100000,"rows_first":2000,"rows_last":500,"rows_between":2000,"halvings":0,"cell_chars":16384,"cell_head_chars":4096},"cells_cut":0,"cells_raw":0,"read":"whole","date_system":"1900"}

{"sheet":"lista do wyboru","index":0,"n_rows":160,"n_cols":8,"rows_kept":160,"cut":false,"hidden":false,"merged":[[0,0,0,7],[1,0,1,7],[2,0,2,7],[3,0,3,7]]}
["Specyfikacja techniczna rekomendowanego wyposażenia pracowni przyrody"]
["Szanowni Państwo, \nponiżej znajdują sie wyselekcjonowane produkty dedykowane do pracowni przyrody.\n\nDecydując się na wybrany produkt prosimy o wpisanie odpowiedniej ilości w kolumnie pod nazwą \"Ilość\".\nW drugim arkuszu tego pliku o nazwie \"wybrane produkty - podsumowanie\" automatycznie wyświetli się Państwu kalkulacja wybranych produktów.\n\nJeżeli mają Państwo życzenie korzystać tylko z jednej kategorii produktów proszę dokonać jej wyboru w oknie znajdującym się poniżej."]
["Dane placówki:\n"]
["Wybierz Kategorię:"]
["Kategoria","Kod","Nazwa","Opis ","Ilość","Cena \nbrutto",null,"Zdjecie"]
["Przyrządy i urządzenia do obserwacji","571072","Lupa śr. 90 mm","• śr. głównej soczewki (powiększenie 2,5x): 90 mm • śr. 2 soczewki (4,5x): 21 mm • śr. 3 soczewki (25x): 20 mm • śr. 4 soczewki (55x): 12 mm • 4 podświetlające diody LED ze światłem białym i 1 z UV • wym. całkowite: 22,5 x 10,5 x 2,8 cm.",0,35.9,{"$f":"E6>0","v":false}]
["Przyrządy i urządzenia do obserwacji","571073","Pudełko do obserwacji okazów z 2 lupami","Przezroczyste plastikowe pudełko w kształcie walca, z dwoma lupami wbudowanymi w zdejmowaną pokrywę. Umożliwia bezpieczną i humanitarną obserwację okazów owadów i innych bezkręgowców, a następnie wypuszczenie ich do naturalnego otoczenia • pokrywa wyposażona w otwory wentylacyjne • dno z siatką ułatwiającą porównywanie wielkości okazów • min. 2-krotne powiększenie • wys. 7,8 cm • śr. 6,2-6,9 cm • śr. otworu z lupą: 4,3 cm • śr. 2 lupy: 3,6 cm.",0,9.9,{"$f":"E7>0","v":false}]
["Przyrządy i urządzenia do obserwacji","507002","Zestaw pudełek do obserwacji okazów","Zestaw 6 małych pojemniczków z przykrywką ze szkłem powiększającym. Całość w poręcznym opakowaniu. Zestaw wykonany z przezroczystego plastiku, pozwala na długofalową obserwację procesów przyrodniczych. • śr. pojemniczka 4 cm",0,59.9,false]
["Przyrządy i urządzenia do obserwacji","571075","Lornetka","Lornetka dachopryzmatyczna z kolorowymi soczewkami ze szkła optycznego BK7 • powiększenie 10x • kąt widzenia 5.8 ° • śr. soczewek 25 mm • śr. okularu 13,2 mm • waga 170 g.",0,49.9,false]
["Przyrządy i urządzenia do obserwacji","571076","Teleskop","Teleskop astronomiczny z podstawowym obiektywem. Umożliwia obserwację planet i księżyca, w dobrych warunkach (tzw. ciemne niebo) pozwala dostrzec 150-200 galaktyk i gromad gwiazd. Montaż azymutalny gwarantuje dobrą sztywność, umożliwiając obserwację przy dużych powiększeniach, a jednocześnie teleskop jest prosty w obsłudze. Lekki, wytrzymały statyw z aluminium wyposażony w półkę z regulowaną wysokością • Apertura: 60 mm • Ogniskowa: 700 mm, f/11.6, 600mm f/10 • Szukacz: 5*24 • Przekątna (hybrid diagonal): 90° • Wysokość MOSL: 125 cm • Taca na akcesoria • Okular: SR4mm + H6mm + H12.5mm + H20mm, 3 x soczewka Barlowa, podajnik 1,5.",0,299.89999999999998,false]
["Przyrządy i urządzenia do obserwacji","571077","Mikroskop - wersja zasilana z sieci","Mikroskop optyczny do codziennego użytku w pracowni biologicznej. Zasilany sieciowo. Wyposażony w podwójny system oświetlenia z płynną regulacją jasności światła przechodzącego i odbitego. Zakres powiększenia od 40 do 400 razy. Głowa lornetki pod kątem 45°, obracana o 360°. Stolik do preparatów  uchwytem krzyżowym i specjalną skalą poprawiającą dokładność odczytów • Okular szerokopolowy WF 10x • Obiektyw achromatyczny 4x, 10x, 40x (S) • Stolik na preparaty o wym. 9 x 9 cm • Regulacja ostrości: 15 mm • Kondenser NA0.65 z przysłoną • oświetlenie LED • wym. całkowite: 18,5 x 14 x 29 cm • W zestawie:\n- pokrowiec\n- nożyczki\n- pęseta\n- pipeta\n- odczynniki\n- zestaw 15 preparatów.\n",0,599.9,false]
["Preparaty biologiczne do obserwacji mikroskopowych ","571108","Zestaw preparatów mikroskopowych - bezkręgowce","• zestaw zawiera 5 preparatów, m.in. z dżdżownic i mrówek.",0,35.9,false]
["Preparaty biologiczne do obserwacji mikroskopowych ","571109","Zestaw preparatów mikroskopowych - skrzydła owadów","• zestaw zawiera 5 preparatów, m.in. ze skrzydeł pszczoły i motyla. ",0,35.9,false]
["Preparaty biologiczne do obserwacji mikroskopowych ","571110","Zestaw preparatów mikroskopowych - rośliny jadalne","• zestaw zawiera 5 preparatów, m.in. z korzenia cebuli i łodygi kukurydzy.",0,35.9,false]
["Preparaty biologiczne do obserwacji mikroskopowych ","571111","Zestaw preparatów mikroskopowych - tkanki ssaków","• zestaw zawiera 5 preparatów, m.in. z ludzkiego żołądka, serca i krwi.",0,35.9,false]
["Preparaty biologiczne do obserwacji mikroskopowych ","571112","Zestaw preparatów mikroskopowych - grzyby","• zestaw zawiera 5 preparatów, m.in. Rhizopus (pleśń z chleba) i Penicillium (Pędzlak).",0,35.9,false]
["Preparaty biologiczne do obserwacji mikroskopowych ","571113","Zestaw preparatów mikroskopowych - co żyje w kropli wody","• zestaw zawiera 10 preparatów, m.in. z różnych formy okrzemek, eugleny zielonej  i pchły.",0,99.9,false]
["Preparaty biologiczne do obserwacji mikroskopowych ","571114","Zestaw preparatów mikroskopowych - tkanki człowieka","• zestaw zawiera 20 preparatów, m.in. z wymazem z ludzkich krwinek, mięśni poprzecznie prążkowanych, ludzkiego mózgu, przekroju ludzkiej skóry i tkanki wątroby.",0,119.9,false]
["Preparaty biologiczne do obserwacji mikroskopowych ","571115","Zestaw preparatów mikroskopowych - tkanki człowieka zmienione chorobowo","• zestaw zawiera 10 preparatów, m.in. z gruźlicą (prosówka) w wątrobie, pylicą w płucach i malarią we krwi.",0,279.89999999999998,false]
["Preparaty biologiczne do obserwacji mikroskopowych ","571116","Zestaw preparatów mikroskopowych - preparaty zoologiczne","• zestaw zawiera 30 preparatów, m.in. z Pantofelkiem, trzema rodzajami bakterii, krwią, wymazem z żaby, organizmem jednokomórkowym, rozwielitkami, Dafnią, tasiemiecem bąblowcem, złożonym okiem owada, robakiem (przekrój), dżdżownicą (przekrój) , otworami gębowymi kilku owadów.",0,199.9,false]
["Preparaty biologiczne do obserwacji mikroskopowych ","571117","Zestaw preparatów mikroskopowych - przyroda","• zestaw zawiera 10 preparatów, m.in. z odnóża muchy, skrzydła ptaka i motyla oraz wymazem krwi ludzkiej.",0,69.900000000000006,false]
["Preparaty biologiczne do obserwacji mikroskopowych ","571122","Zestaw preparatów biologicznych 50 szt.","Zestaw preparatów mikroskopowych zawierający 50 gotowych preparatów na szkiełkach o wym. 7,6 x 2,5 x 0,1 cm. W zestawie preparaty z m.in. przekrojami poprzecznymi wątroby królika i ludzkich mięśni szkieletowych, wymazem z krwi żaby, odnożami i otworem gębowym owadów czy kaczym włosem.",0,199.9,false]
["Preparaty biologiczne do obserwacji mikroskopowych ","571123","Zestaw preparatów biologicznych 100 szt.","Zestaw preparatów mikroskopowych zawierający 100 gotowych preparatów na szkiełkach o wym. 7,6 x 2,5 x 0,1 cm. W zestawie preparaty z m.in. RNA i DNA, penicyliną, bakteriami Actinomyces, przekrojem ludzkiej nerki i wymazem z krwi, liściem ryżu czy przkrojem podłużnym łodygi kukurydzy. ",0,399.9,false]
["Przyrządy do pomiarów i wykonywania doświadczeń","500135","Taśma miernicza","Taśma dwustronna zwijana. Z jednej strony centymetry i milimetry, po drugiej cale. \nDł. taśmy 20 m",0,59.9,false]
["Przyrządy do pomiarów i wykonywania doświadczeń","514019","Stoper","Stoper to doskonały gadżet dla początkującego sportowca. • dokładność 1/100 sek. • licznik okrążeń • zegarek • alarm • instrukcja • wymagana bateria AG13 (załączona) ",0,42.9,false]
["Przyrządy do pomiarów i wykonywania doświadczeń","571080","Higrometr i termometr 2w1","Elektroniczny higrometr i termometr z czujnikiem termoparą na kablu o dł. 1 m. • wym. całkowite 19,3 x 8,8 x 2,7 cm • wyświetlacz LCD o wym. 9 x 6,5 cm • zakres pomiaru temperatury wewnątrz: od -10 ℃ do 50 ℃ • zakres pomiaru temperatury na zewnątrz: od -50 ℃ do 70 ℃ • dokładność pomiaru temperatury: 0,1 ° C • zakres pomiaru wilgotności: od 20% RH do 99% RH (gdy wilgotność spadnie poniżej 20% RH, wyświetla 10% RH) • zasilanie: 1 bateria 1.5V (AAA), brak w zestawie.",0,69.900000000000006,false]
["Przyrządy do pomiarów i wykonywania doświadczeń","571107","Termometr laboratoryjny","Laboratoryjny termometr alkoholowy ze szkła, w plastikowej osłonie. Nie zawiera rtęci \n• skala od -20 do 110°C • podziałka co 1 °C • dł. 30,4 cm • śr. 6 mm.",0,6.9,false]
["Przyrządy do pomiarów i wykonywania doświadczeń","571100","Termometr zaokienny","Plastikowy termometr zaokienny • zakres pomiaru temperatury od -40° do + 50° C \n• wym. 40 x 6,3 x 1 cm.",0,39.9,false]
["Przyrządy do pomiarów i wykonywania doświadczeń","841110","Waga elektroniczna - zasilanie z sieci i z baterii","Precyzyjna waga elektroniczna wykonana z plastiku, z wbudowaną na stałe, niewymienną szalką wykonaną ze stali nierdzewnej • zasilana sieciowo (zasilacz 7,5V/230V w zestawie) lub na baterie (6 baterii 1,5V LR6 AA, brak w zestawie) • wyświetlacz LCD • ważenie w gramach i uncjach • funckje: kalibracja, oszczędzanie energii, tarowanie, automatyczne zerowanie, zliczanie ilości sztuk o jednakowej masie • obiążenie maks. 2 kg • dokładność odczytu 0,1 g \n• wym. szalki 12 x 10 cm • wym. całkowite 13 x 16,5 x 6 cm.",0,799.9,false]
["Przyrządy do pomiarów i wykonywania doświadczeń","ZEST5211","Waga szalkowa metalowa + odważniki","Metalowa waga, z płaskimi szalkami. Doskonała do ważenia różnorodnych zabawek, materiałów, jedzenia itp. •wym. 16 x 20 x 49 cm • nośność 5 kg\nW zestawie odważniki:\nZestaw 4 odważników w kartonowym pudełku. • 1 x 500g • 2 x 200g • 1 x 100g\nZestaw 8 odważników: • 1 x 1g • 2 x 2g • 1 x 5g • 2 x 10g • 1 x 20g • 1 x 50g\n",0,409.7,false]
{"$rows_left_out":131}
{"sheet":"Sheet1","index":1,"n_rows":12,"n_cols":1,"rows_kept":12,"cut":false,"hidden":true,"merged":[]}
["Wszystko"]
["Przyrządy i urządzenia do obserwacji"]
["Preparaty biologiczne do obserwacji mikroskopowych "]
["Przyrządy do pomiarów i wykonywania doświadczeń"]
["IT"]
["Sprzęt laboratoryjny, odczynniki chemiczne "]
["Sprzęt ochronny"]
["Sprzęt techniczny i pomocniczy"]
["Globusy, mapy"]
["Modele"]
["Plansze"]
["Drobne artykuły papiernicze"]

{"sheet":"wybrane produkty - podsumowanie","index":2,"n_rows":281,"n_cols":7,"rows_kept":281,"cut":false,"hidden":false,"merged":[[0,0,0,5],[1,0,1,5],[2,0,2,4]]}
["REKOMENDOWANE WYPOSAŻENIE PRACOWNI PRZYRODY"]
[{"$f":"'lista do wyboru'!A3:F3","v":"Dane placówki:\n"}]
["Wybrane produkty",null,null,null,null,"Wartość całkowita \nwybranych produktów:"]
["Kod","Nazwa","Ilość","Cena\nbrutto","Wartość\nbrutto",{"$f":"SUM(E5:E329)","v":0}]
[{"$f":"IF($G5=\"\",\"--\",INDEX('lista do wyboru'!$B$6:$F$160,$G5,1))","v":"--"},{"$f":"IF($G5=\"\",\"--\",INDEX('lista do wyboru'!$B$6:$F$160,$G5,2))","v":"--"},{"$f":"IF($G5=\"\",\"--\",INDEX('lista do wyboru'!$B$6:$F$160,$G5,4))","v":"--"},{"$f":"IF($G5=\"\",\"--\",INDEX('lista do wyboru'!$B$6:$F$160,$G5,5))","v":"--"},{"$f":"IF(C5 = \"--\",0,D5*C5)","v":0},null,{"$f":"IF(FALSE = ISERROR(MATCH(TRUE,OFFSET('lista do wyboru'!$G$6:$G$160,G4,0),0)),G4+MATCH(TRUE,OFFSET('lista do wyboru'!$G$6:$G$160,G4,0),0),\"\")","v":""}]
[{"$f":"IF($G6=\"\",\"--\",INDEX('lista do wyboru'!$B$6:$F$160,$G6,1))","v":"--"},{"$f":"IF($G6=\"\",\"--\",INDEX('lista do wyboru'!$B$6:$F$160,$G6,2))","v":"--"},{"$f":"IF($G6=\"\",\"--\",INDEX('lista do wyboru'!$B$6:$F$160,$G6,4))","v":"--"},{"$f":"IF($G6=\"\",\"--\",INDEX('lista do wyboru'!$B$6:$F$160,$G6,5))","v":"--"},{"$f":"IF(C6 = \"--\",0,D6*C6)","v":0},null,{"$f":"IF(FALSE = ISERROR(MATCH(TRUE,OFFSET('lista do wyboru'!$G$6:$G$160,G5,0),0)),G5+MATCH(TRUE,OFFSET('lista do wyboru'!$G$6:$G$160,G5,0),0),\"\")","v":""}]
[{"$f":"IF($G7=\"\",\"--\",INDEX('lista do wyboru'!$B$6:$F$160,$G7,1))","v":"--"},{"$f":"IF($G7=\"\",\"--\",INDEX('lista do wyboru'!$B$6:$F$160,$G7,2))","v":"--"},{"$f":"IF($G7=\"\",\"--\",INDEX('lista do wyboru'!$B$6:$F$160,$G7,4))","v":"--"},{"$f":"IF($G7=\"\",\"--\",INDEX('lista do wyboru'!$B$6:$F$160,$G7,5))","v":"--"},0,null,{"$f":"IF(FALSE = ISERROR(MATCH(TRUE,OFFSET('lista do wyboru'!$G$6:$G$160,G6,0),0)),G6+MATCH(TRUE,OFFSET('lista do wyboru'!$G$6:$G$160,G6,0),0),\"\")","v":""}]
[{"$f":"IF($G8=\"\",\"--\",INDEX('lista do wyboru'!$B$6:$F$160,$G8,1))","v":"--"},{"$f":"IF($G8=\"\",\"--\",INDEX('lista do wyboru'!$B$6:$F$160,$G8,2))","v":"--"},{"$f":"IF($G8=\"\",\"--\",INDEX('lista do wyboru'!$B$6:$F$160,$G8,4))","v":"--"},{"$f":"IF($G8=\"\",\"--\",INDEX('lista do wyboru'!$B$6:$F$160,$G8,5))","v":"--"},0,null,{"$f":"IF(FALSE = ISERROR(MATCH(TRUE,OFFSET('lista do wyboru'!$G$6:$G$160,G7,0),0)),G7+MATCH(TRUE,OFFSET('lista do wyboru'!$G$6:$G$160,G7,0),0),\"\")","v":""}]
[{"$f":"IF($G9=\"\",\"--\",INDEX('lista do wyboru'!$B$6:$F$160,$G9,1))","v":"--"},{"$f":"IF($G9=\"\",\"--\",INDEX('lista do wyboru'!$B$6:$F$160,$G9,2))","v":"--"},{"$f":"IF($G9=\"\",\"--\",INDEX('lista do wyboru'!$B$6:$F$160,$G9,4))","v":"--"},{"$f":"IF($G9=\"\",\"--\",INDEX('lista do wyboru'!$B$6:$F$160,$G9,5))","v":"--"},0,null,{"$f":"IF(FALSE = ISERROR(MATCH(TRUE,OFFSET('lista do wyboru'!$G$6:$G$160,G8,0),0)),G8+MATCH(TRUE,OFFSET('lista do wyboru'!$G$6:$G$160,G8,0),0),\"\")","v":""}]
[{"$f":"IF($G10=\"\",\"--\",INDEX('lista do wyboru'!$B$6:$F$160,$G10,1))","v":"--"},{"$f":"IF($G10=\"\",\"--\",INDEX('lista do wyboru'!$B$6:$F$160,$G10,2))","v":"--"},{"$f":"IF($G10=\"\",\"--\",INDEX('lista do wyboru'!$B$6:$F$160,$G10,4))","v":"--"},{"$f":"IF($G10=\"\",\"--\",INDEX('lista do wyboru'!$B$6:$F$160,$G10,5))","v":"--"},0,null,{"$f":"IF(FALSE = ISERROR(MATCH(TRUE,OFFSET('lista do wyboru'!$G$6:$G$160,G9,0),0)),G9+MATCH(TRUE,OFFSET('lista do wyboru'!$G$6:$G$160,G9,0),0),\"\")","v":""}]
[{"$f":"IF($G11=\"\",\"--\",INDEX('lista do wyboru'!$B$6:$F$160,$G11,1))","v":"--"},{"$f":"IF($G11=\"\",\"--\",INDEX('lista do wyboru'!$B$6:$F$160,$G11,2))","v":"--"},{"$f":"IF($G11=\"\",\"--\",INDEX('lista do wyboru'!$B$6:$F$160,$G11,4))","v":"--"},{"$f":"IF($G11=\"\",\"--\",INDEX('lista do wyboru'!$B$6:$F$160,$G11,5))","v":"--"},0,null,{"$f":"IF(FALSE = ISERROR(MATCH(TRUE,OFFSET('lista do wyboru'!$G$6:$G$160,G10,0),0)),G10+MATCH(TRUE,OFFSET('lista do wyboru'!$G$6:$G$160,G10,0),0),\"\")","v":""}]
[{"$f":"IF($G12=\"\",\"--\",INDEX('lista do wyboru'!$B$6:$F$160,$G12,1))","v":"--"},{"$f":"IF($G12=\"\",\"--\",INDEX('lista do wyboru'!$B$6:$F$160,$G12,2))","v":"--"},{"$f":"IF($G12=\"\",\"--\",INDEX('lista do wyboru'!$B$6:$F$160,$G12,4))","v":"--"},{"$f":"IF($G12=\"\",\"--\",INDEX('lista do wyboru'!$B$6:$F$160,$G12,5))","v":"--"},0,null,{"$f":"IF(FALSE = ISERROR(MATCH(TRUE,OFFSET('lista do wyboru'!$G$6:$G$160,G11,0),0)),G11+MATCH(TRUE,OFFSET('lista do wyboru'!$G$6:$G$160,G11,0),0),\"\")","v":""}]
[{"$f":"IF($G13=\"\",\"--\",INDEX('lista do wyboru'!$B$6:$F$160,$G13,1))","v":"--"},{"$f":"IF($G13=\"\",\"--\",INDEX('lista do wyboru'!$B$6:$F$160,$G13,2))","v":"--"},{"$f":"IF($G13=\"\",\"--\",INDEX('lista do wyboru'!$B$6:$F$160,$G13,4))","v":"--"},{"$f":"IF($G13=\"\",\"--\",INDEX('lista do wyboru'!$B$6:$F$160,$G13,5))","v":"--"},0,null,{"$f":"IF(FALSE = ISERROR(MATCH(TRUE,OFFSET('lista do wyboru'!$G$6:$G$160,G12,0),0)),G12+MATCH(TRUE,OFFSET('lista do wyboru'!$G$6:$G$160,G12,0),0),\"\")","v":""}]
[{"$f":"IF($G14=\"\",\"--\",INDEX('lista do wyboru'!$B$6:$F$160,$G14,1))","v":"--"},{"$f":"IF($G14=\"\",\"--\",INDEX('lista do wyboru'!$B$6:$F$160,$G14,2))","v":"--"},{"$f":"IF($G14=\"\",\"--\",INDEX('lista do wyboru'!$B$6:$F$160,$G14,4))","v":"--"},{"$f":"IF($G14=\"\",\"--\",INDEX('lista do wyboru'!$B$6:$F$160,$G14,5))","v":"--"},0,null,{"$f":"IF(FALSE = ISERROR(MATCH(TRUE,OFFSET('lista do wyboru'!$G$6:$G$160,G13,0),0)),G13+MATCH(TRUE,OFFSET('lista do wyboru'!$G$6:$G$160,G13,0),0),\"\")","v":""}]
[{"$f":"IF($G15=\"\",\"--\",INDEX('lista do wyboru'!$B$6:$F$160,$G15,1))","v":"--"},{"$f":"IF($G15=\"\",\"--\",INDEX('lista do wyboru'!$B$6:$F$160,$G15,2))","v":"--"},{"$f":"IF($G15=\"\",\"--\",INDEX('lista do wyboru'!$B$6:$F$160,$G15,4))","v":"--"},{"$f":"IF($G15=\"\",\"--\",INDEX('lista do wyboru'!$B$6:$F$160,$G15,5))","v":"--"},0,null,{"$f":"IF(FALSE = ISERROR(MATCH(TRUE,OFFSET('lista do wyboru'!$G$6:$G$160,G14,0),0)),G14+MATCH(TRUE,OFFSET('lista do wyboru'!$G$6:$G$160,G14,0),0),\"\")","v":""}]
[{"$f":"IF($G16=\"\",\"--\",INDEX('lista do wyboru'!$B$6:$F$160,$G16,1))","v":"--"},{"$f":"IF($G16=\"\",\"--\",INDEX('lista do wyboru'!$B$6:$F$160,$G16,2))","v":"--"},{"$f":"IF($G16=\"\",\"--\",INDEX('lista do wyboru'!$B$6:$F$160,$G16,4))","v":"--"},{"$f":"IF($G16=\"\",\"--\",INDEX('lista do wyboru'!$B$6:$F$160,$G16,5))","v":"--"},0,null,{"$f":"IF(FALSE = ISERROR(MATCH(TRUE,OFFSET('lista do wyboru'!$G$6:$G$160,G15,0),0)),G15+MATCH(TRUE,OFFSET('lista do wyboru'!$G$6:$G$160,G15,0),0),\"\")","v":""}]
[{"$f":"IF($G17=\"\",\"--\",INDEX('lista do wyboru'!$B$6:$F$160,$G17,1))","v":"--"},{"$f":"IF($G17=\"\",\"--\",INDEX('lista do wyboru'!$B$6:$F$160,$G17,2))","v":"--"},{"$f":"IF($G17=\"\",\"--\",INDEX('lista do wyboru'!$B$6:$F$160,$G17,4))","v":"--"},{"$f":"IF($G17=\"\",\"--\",INDEX('lista do wyboru'!$B$6:$F$160,$G17,5))","v":"--"},0,null,{"$f":"IF(FALSE = ISERROR(MATCH(TRUE,OFFSET('lista do wyboru'!$G$6:$G$160,G16,0),0)),G16+MATCH(TRUE,OFFSET('lista do wyboru'!$G$6:$G$160,G16,0),0),\"\")","v":""}]
[{"$f":"IF($G18=\"\",\"--\",INDEX('lista do wyboru'!$B$6:$F$160,$G18,1))","v":"--"},{"$f":"IF($G18=\"\",\"--\",INDEX('lista do wyboru'!$B$6:$F$160,$G18,2))","v":"--"},{"$f":"IF($G18=\"\",\"--\",INDEX('lista do wyboru'!$B$6:$F$160,$G18,4))","v":"--"},{"$f":"IF($G18=\"\",\"--\",INDEX('lista do wyboru'!$B$6:$F$160,$G18,5))","v":"--"},0,null,{"$f":"IF(FALSE = ISERROR(MATCH(TRUE,OFFSET('lista do wyboru'!$G$6:$G$160,G17,0),0)),G17+MATCH(TRUE,OFFSET('lista do wyboru'!$G$6:$G$160,G17,0),0),\"\")","v":""}]
[{"$f":"IF($G19=\"\",\"--\",INDEX('lista do wyboru'!$B$6:$F$160,$G19,1))","v":"--"},{"$f":"IF($G19=\"\",\"--\",INDEX('lista do wyboru'!$B$6:$F$160,$G19,2))","v":"--"},{"$f":"IF($G19=\"\",\"--\",INDEX('lista do wyboru'!$B$6:$F$160,$G19,4))","v":"--"},{"$f":"IF($G19=\"\",\"--\",INDEX('lista do wyboru'!$B$6:$F$160,$G19,5))","v":"--"},0,null,{"$f":"IF(FALSE = ISERROR(MATCH(TRUE,OFFSET('lista do wyboru'!$G$6:$G$160,G18,0),0)),G18+MATCH(TRUE,OFFSET('lista do wyboru'!$G$6:$G$160,G18,0),0),\"\")","v":""}]
[{"$f":"IF($G20=\"\",\"--\",INDEX('lista do wyboru'!$B$6:$F$160,$G20,1))","v":"--"},{"$f":"IF($G20=\"\",\"--\",INDEX('lista do wyboru'!$B$6:$F$160,$G20,2))","v":"--"},{"$f":"IF($G20=\"\",\"--\",INDEX('lista do wyboru'!$B$6:$F$160,$G20,4))","v":"--"},{"$f":"IF($G20=\"\",\"--\",INDEX('lista do wyboru'!$B$6:$F$160,$G20,5))","v":"--"},0,null,{"$f":"IF(FALSE = ISERROR(MATCH(TRUE,OFFSET('lista do wyboru'!$G$6:$G$160,G19,0),0)),G19+MATCH(TRUE,OFFSET('lista do wyboru'!$G$6:$G$160,G19,0),0),\"\")","v":""}]
[{"$f":"IF($G21=\"\",\"--\",INDEX('lista do wyboru'!$B$6:$F$160,$G21,1))","v":"--"},{"$f":"IF($G21=\"\",\"--\",INDEX('lista do wyboru'!$B$6:$F$160,$G21,2))","v":"--"},{"$f":"IF($G21=\"\",\"--\",INDEX('lista do wyboru'!$B$6:$F$160,$G21,4))","v":"--"},{"$f":"IF($G21=\"\",\"--\",INDEX('lista do wyboru'!$B$6:$F$160,$G21,5))","v":"--"},0,null,{"$f":"IF(FALSE = ISERROR(MATCH(TRUE,OFFSET('lista do wyboru'!$G$6:$G$160,G20,0),0)),G20+MATCH(TRUE,OFFSET('lista do wyboru'!$G$6:$G$160,G20,0),0),\"\")","v":""}]
[{"$f":"IF($G22=\"\",\"--\",INDEX('lista do wyboru'!$B$6:$F$160,$G22,1))","v":"--"},{"$f":"IF($G22=\"\",\"--\",INDEX('lista do wyboru'!$B$6:$F$160,$G22,2))","v":"--"},{"$f":"IF($G22=\"\",\"--\",INDEX('lista do wyboru'!$B$6:$F$160,$G22,4))","v":"--"},{"$f":"IF($G22=\"\",\"--\",INDEX('lista do wyboru'!$B$6:$F$160,$G22,5))","v":"--"},0,null,{"$f":"IF(FALSE = ISERROR(MATCH(TRUE,OFFSET('lista do wyboru'!$G$6:$G$160,G21,0),0)),G21+MATCH(TRUE,OFFSET('lista do wyboru'!$G$6:$G$160,G21,0),0),\"\")","v":""}]
[{"$f":"IF($G23=\"\",\"--\",INDEX('lista do wyboru'!$B$6:$F$160,$G23,1))","v":"--"},{"$f":"IF($G23=\"\",\"--\",INDEX('lista do wyboru'!$B$6:$F$160,$G23,2))","v":"--"},{"$f":"IF($G23=\"\",\"--\",INDEX('lista do wyboru'!$B$6:$F$160,$G23,4))","v":"--"},{"$f":"IF($G23=\"\",\"--\",INDEX('lista do wyboru'!$B$6:$F$160,$G23,5))","v":"--"},0,null,{"$f":"IF(FALSE = ISERROR(MATCH(TRUE,OFFSET('lista do wyboru'!$G$6:$G$160,G22,0),0)),G22+MATCH(TRUE,OFFSET('lista do wyboru'!$G$6:$G$160,G22,0),0),\"\")","v":""}]
[{"$f":"IF($G24=\"\",\"--\",INDEX('lista do wyboru'!$B$6:$F$160,$G24,1))","v":"--"},{"$f":"IF($G24=\"\",\"--\",INDEX('lista do wyboru'!$B$6:$F$160,$G24,2))","v":"--"},{"$f":"IF($G24=\"\",\"--\",INDEX('lista do wyboru'!$B$6:$F$160,$G24,4))","v":"--"},{"$f":"IF($G24=\"\",\"--\",INDEX('lista do wyboru'!$B$6:$F$160,$G24,5))","v":"--"},0,null,{"$f":"IF(FALSE = ISERROR(MATCH(TRUE,OFFSET('lista do wyboru'!$G$6:$G$160,G23,0),0)),G23+MATCH(TRUE,OFFSET('lista do wyboru'!$G$6:$G$160,G23,0),0),\"\")","v":""}]
[{"$f":"IF($G25=\"\",\"--\",INDEX('lista do wyboru'!$B$6:$F$160,$G25,1))","v":"--"},{"$f":"IF($G25=\"\",\"--\",INDEX('lista do wyboru'!$B$6:$F$160,$G25,2))","v":"--"},{"$f":"IF($G25=\"\",\"--\",INDEX('lista do wyboru'!$B$6:$F$160,$G25,4))","v":"--"},{"$f":"IF($G25=\"\",\"--\",INDEX('lista do wyboru'!$B$6:$F$160,$G25,5))","v":"--"},0,null,{"$f":"IF(FALSE = ISERROR(MATCH(TRUE,OFFSET('lista do wyboru'!$G$6:$G$160,G24,0),0)),G24+MATCH(TRUE,OFFSET('lista do wyboru'!$G$6:$G$160,G24,0),0),\"\")","v":""}]
[{"$f":"IF($G26=\"\",\"--\",INDEX('lista do wyboru'!$B$6:$F$160,$G26,1))","v":"--"},{"$f":"IF($G26=\"\",\"--\",INDEX('lista do wyboru'!$B$6:$F$160,$G26,2))","v":"--"},{"$f":"IF($G26=\"\",\"--\",INDEX('lista do wyboru'!$B$6:$F$160,$G26,4))","v":"--"},{"$f":"IF($G26=\"\",\"--\",INDEX('lista do wyboru'!$B$6:$F$160,$G26,5))","v":"--"},0,null,{"$f":"IF(FALSE = ISERROR(MATCH(TRUE,OFFSET('lista do wyboru'!$G$6:$G$160,G25,0),0)),G25+MATCH(TRUE,OFFSET('lista do wyboru'!$G$6:$G$160,G25,0),0),\"\")","v":""}]
[{"$f":"IF($G27=\"\",\"--\",INDEX('lista do wyboru'!$B$6:$F$160,$G27,1))","v":"--"},{"$f":"IF($G27=\"\",\"--\",INDEX('lista do wyboru'!$B$6:$F$160,$G27,2))","v":"--"},{"$f":"IF($G27=\"\",\"--\",INDEX('lista do wyboru'!$B$6:$F$160,$G27,4))","v":"--"},{"$f":"IF($G27=\"\",\"--\",INDEX('lista do wyboru'!$B$6:$F$160,$G27,5))","v":"--"},0,null,{"$f":"IF(FALSE = ISERROR(MATCH(TRUE,OFFSET('lista do wyboru'!$G$6:$G$160,G26,0),0)),G26+MATCH(TRUE,OFFSET('lista do wyboru'!$G$6:$G$160,G26,0),0),\"\")","v":""}]
[{"$f":"IF($G28=\"\",\"--\",INDEX('lista do wyboru'!$B$6:$F$160,$G28,1))","v":"--"},{"$f":"IF($G28=\"\",\"--\",INDEX('lista do wyboru'!$B$6:$F$160,$G28,2))","v":"--"},{"$f":"IF($G28=\"\",\"--\",INDEX('lista do wyboru'!$B$6:$F$160,$G28,4))","v":"--"},{"$f":"IF($G28=\"\",\"--\",INDEX('lista do wyboru'!$B$6:$F$160,$G28,5))","v":"--"},0,null,{"$f":"IF(FALSE = ISERROR(MATCH(TRUE,OFFSET('lista do wyboru'!$G$6:$G$160,G27,0),0)),G27+MATCH(TRUE,OFFSET('lista do wyboru'!$G$6:$G$160,G27,0),0),\"\")","v":""}]
[{"$f":"IF($G29=\"\",\"--\",INDEX('lista do wyboru'!$B$6:$F$160,$G29,1))","v":"--"},{"$f":"IF($G29=\"\",\"--\",INDEX('lista do wyboru'!$B$6:$F$160,$G29,2))","v":"--"},{"$f":"IF($G29=\"\",\"--\",INDEX('lista do wyboru'!$B$6:$F$160,$G29,4))","v":"--"},{"$f":"IF($G29=\"\",\"--\",INDEX('lista do wyboru'!$B$6:$F$160,$G29,5))","v":"--"},0,null,{"$f":"IF(FALSE = ISERROR(MATCH(TRUE,OFFSET('lista do wyboru'!$G$6:$G$160,G28,0),0)),G28+MATCH(TRUE,OFFSET('lista do wyboru'!$G$6:$G$160,G28,0),0),\"\")","v":""}]
[{"$f":"IF($G30=\"\",\"--\",INDEX('lista do wyboru'!$B$6:$F$160,$G30,1))","v":"--"},{"$f":"IF($G30=\"\",\"--\",INDEX('lista do wyboru'!$B$6:$F$160,$G30,2))","v":"--"},{"$f":"IF($G30=\"\",\"--\",INDEX('lista do wyboru'!$B$6:$F$160,$G30,4))","v":"--"},{"$f":"IF($G30=\"\",\"--\",INDEX('lista do wyboru'!$B$6:$F$160,$G30,5))","v":"--"},0,null,{"$f":"IF(FALSE = ISERROR(MATCH(TRUE,OFFSET('lista do wyboru'!$G$6:$G$160,G29,0),0)),G29+MATCH(TRUE,OFFSET('lista do wyboru'!$G$6:$G$160,G29,0),0),\"\")","v":""}]
{"$rows_left_out":251}