{"text_format":"1","workbook":"xlsx","n_sheets":3,"sheets":["lista do wyboru","wybrane produkty - podsumowanie","Arkusz2"],"not_rendered":{"charts":0,"images":129,"macros":1,"external_links":0,"defined_names":3,"comments":0,"pivot_tables":0},"unopened":[],"bounds":{"document_bytes":16777216,"sheet_cells":100000,"rows_first":2000,"rows_last":500,"rows_between":2000,"halvings":0,"cell_chars":16384,"cell_head_chars":4096},"cells_cut":0,"cells_raw":0,"read":"whole","date_system":"1900"}

{"sheet":"lista do wyboru","index":0,"n_rows":136,"n_cols":8,"rows_kept":136,"cut":false,"hidden":false,"merged":[[128,6,131,6],[2,5,3,6],[2,0,3,1],[0,0,0,6],[1,0,1,6],[128,5,131,5]]}
["Szanowni Państwo, \nponiżej znajdują sie wyselekcjonowane produkty prezentowane na organizowanej przez naszą firmę Konferencji. \n\nDecydując się na wybrany produkt prosimy o wpisanie odpowiedniej ilości w kolumnie pod nazwą \"Ilość\".\nW drugim arkuszu tego pliku o nazwie \"wybrane produkty - podsumowanie\" automatycznie wyświetli się Państwu kalkulacja wybranych produktów.\n\nJeżeli mają Państwo życzenie korzystać tylko z jednej kategorii produktów proszę dokonać jej wyboru w oknie znajdującym się poniżej.\n\nPromocja dla uczestników konferencji - przy zamówieniu o wartości powyżej 100 zł dostawa GRATIS"]
["Dane placówki:\n"]
["Wybierz kategorię:"]
[]
["Kategoria","Kod","Nazwa","Ilość","Cena\nbrutto","Opis","Zdjęcie"]
["Aranżacje","092186","Quadro - regał uniwersalny",0,579.9,"Regał należy wyposażyć w 2 wąskie szuflady (092262-092273, sprzedawane osobno). • wym. 41,5 x 41,5 x 124,2 cm • w komplecie tablica suchościeralna o wym. 30 x 60 cm",null,{"$f":"D6>0","v":false}]
["Aranżacje","SET6014","Quadro - zestaw 11",0,799.8,"Drzwiczki i szuflady wyposażone we wpuszczane uchwyty w kolorze aluminium.\n• 092101 Quadro - mobilny pojemnik-biblioteczka, 1 szt.\n• 092102 Quadro - biblioteczka z ławeczką, 1 szt.",null,{"$f":"D7>0","v":false}]
["Aranżacje","092138","Quadro - szafka S na 4 szuflady na kółkach",0,289.89999999999998,"Szafka dostosowana do wąskich szuflad (092262-092273, sprzedawane osobno).\n• wym. 79,2 x 41,5 x 49,4 cm",null,false]
["Aranżacje","092266","Quadro - szuflada wąska - limonkowa",0,79.900000000000006,"• wym. frontu 37 x 18,3 cm",null,false]
["Aranżacje","092270","Quadro - szuflada wąska - jasnoróżowa",0,79.900000000000006,"• wym. frontu 37 x 18,3 cm",null,false]
["Aranżacje","092263","Quadro - szuflada wąska - szara",0,79.900000000000006,"• wym. frontu 37 x 18,3 cm",null,false]
["Aranżacje","092262","Quadro - szuflada wąska - biała",0,79.900000000000006,"• wym. frontu 37 x 18,3 cm",null,false]
["Aranżacje","092195","Quadro - szafka-domek",0,799.9,"Szafka - kryjówka w kształcie domku z aplikacją - ścianką z oknem. Dzieci mogą usiąść wygodnie w środku, zrelaksować i wyciszyć. Do uzupełnienia szafki można wykorzystać siedziska (101486 lub 101487, sprzedawane osobno). • wym. 130 x 60 x 173,5 cm",null,false]
["Aranżacje","101486","Materac - siedzisko szare do domku Colores Plus",0,359.9,"Wygodny materac uzupełniający szafkę-domek Quadro (092195), można go wykorzystać także jako osobne siedzisko. • wym. 126 x 55,5 x 14 cm • wys. boków 94 i 75 cm",null,false]
["Aranżacje","101577","Duży zestaw materacy Quadro 2",0,1259.5,"Piankowe materace w różnych kolorach, kształtach i rozmiarach. Wykonane z trudnopalnej pianki i trudnopalnej tkaniny. Dzięki bardzo dużej odporności na plamy i zabrudzenia idealnie sprawdzi się w przedszkolach i szkołach. Parametry tkaniny: 100 % poliester; gramatura: 476 g/mb; klasa palności: B1; ścieralność: 96 000 cykli.\n• 101581 Materac Quadro 2 brązowy, wys. 10 cm\n• 101582 Materac Quadro 2 ciemnoszary, wys. 10 cm\n• 101583 Materac Quadro 2 zielony, wys. 15 cm\n• 101584 Materac Quadro 2 żółty, wys. 15 cm\n• 101585 Materac Quadro 2 jasnozielony, wys. 15 cm\n• wymiary po złożeniu są zależne od sposobu ułożenia materacy",null,false]
["Aranżacje","SET6047","Quadro - zestaw 44",0,499.8,"Drzwiczki i szuflady są wyposażone we wpuszczane uchwyty w kolorze aluminium.\n• 092136 Quadro - szafka S z 1 półką na kółkach, 1 szt.\n• 101488 Quadro - kącik kuchenny - nakrycie na szafkę, 1 szt.",null,false]
["Aranżacje","100887","Kącik Poczta z akcesoriami",0,499.9,"Kącik zabaw dla małego listonosza, wykonany z płyty laminowanej w tonacji brzozy, o gr. 18 mm. Wyposażony w praktyczne makatki z kieszonkami do segregowania listów (po 4 z każdej strony), skrzynkę oraz gałkę do zawieszania torby. • wys. blatu 62,5 cm • wym. 73 x 51 x 159,5 cm \nDodatkowo w komplecie akcesoria:\n• okienko kartonowe z telefonem na jednym i skrzynką pocztową na drugim boku, o wym. 32 x 13 x 21 cm\n• tabliczka &quot;okienko czynne&quot;\n• paczka\n• karta bankowa\n• karta telefoniczna\n• kartki pocztowe, 6 szt.\n• koperta, 1 szt. \n• arkusz znaczków samoprzylepnych, 55 szt.\n• stempel\n• potwierdzenie nadania, 6 szt.\n• druk przelewu, 6 szt.\n• dowód nadania paczki, 3 szt.\n• druk nadania przesyłki kurierskiej, 6 szt.\n• druk przekazu pocztowego, 6 szt.\n• banknoty w nominałach od 10 zł do 200 zł, 48 szt. \n• monety w nominałach od 1 gr do 5 zł, 24 szt.",null,false]
["Aranżacje","101444","Fotel Inflamea 1, 2 os. - jasnozielony",0,959.9,"Wygodne fotele o nowoczesnym kształcie, w wielu kolorach do wyboru. Metalowe okrągłe nóżki umożliwiają poziomowanie mebla. Siedziska i oparcia są pokryte wysokiej jakości, bardzo wytrzymałą tkaniną. Dzięki bardzo dużej odporności na plamy i zabrudzenia idealnie sprawdzi się w przedszkolach i szkołach. 100 % poliester. Gramatura: 476 g/mb. Klasa palności: B1. Ścieralność: 96 000 cykli. • wys. siedziska 41 cm • gł. siedziska 52 cm • wym. 123 x 70 x 80 cm",null,false]
["Aranżacje","101421","Piankowa lokomotywa",0,1199.9000000000001,"Zestaw pianek składający się z 15 części (w tym 6 kół). Elementy tworzą wielobarwną lokomotywę, która zachęci dzieci do ćwiczeń i rozwijania swojej koordynacji ruchowej. • wym. po złożeniu 160 x 60 x 117 cm • wym. elem. od 50 x 50 x 40 cm do 25 x 10 cm",null,false]
["Aranżacje","056101","Dywan okrągły o śr. 2 m - szaro-zielony",0,459.9,"Skład runa 100% PP heat-set frise, przędza pojedyncza. Posiadają Certyfikat Zgodności tzn. Atest Higieniczny. • śr. 2 m",null,false]
["Aranżacje","101409","Pufa krowa",0,159.9,"Miękkie pufy-zwierzątka w wesołych kolorach, wykonane z pianki, z pokrowcem z trwałej tkaniny PCV, łatwej do utrzymania w czystości. • wym. 46 x 54 x 43 cm • wym. siedziska 30 x 50 x 26 cm",null,false]
["Aranżacje","101416","Pufa smok Bambik",0,159.9,"Miękkie pufy-zwierzątka w wesołych kolorach, wykonane z pianki, z pokrowcem z trwałej tkaniny PCV, łatwej do utrzymania w czystości. • wym. 46 x 54 x 43 cm • wym. siedziska 30 x 50 x 26 cm",null,false]
["Aranżacje","511038","Ocean",0,39.9,"Podczas poruszania przemieszczające się wewnątrz metalowe kuleczki imitują dźwięk szumu fal. • śr. 25 cm",null,false]
["Aranżacje","511037","Deszcz",0,59.9,"Instrument wykonany z tworzywa sztucznego. W środku umieszczono małe kolorowe koraliki, które spadając w dół wywołują charakterystyczny dla deszczu dźwięk. • dł. 53,5 cm • śr. 4,5 cm",null,false]
["Aranżacje","604020","Tarka mała",0,99.9,"• śr. 6 cm",null,false]
["Aranżacje","089028","Pokrywa do kolorowych tacek",0,11.9,"Pozwala zamknąć cały zestaw tacek (089029, sprzedawany osobno) zapobiegając wysypaniu się kaszy. Do zestawu tacek ułożonych w stos wystarczy jedna pokrywka. • drewniana pokrywka o wym. 32 x 23,5 x 0,5 cm",null,false]
["Aranżacje","089029","Zestaw kolorowych tacek",0,149.9,"Zdarzają się czasem tak odważne drzewa, że próbują powstrzymać napór piaskowej wydmy. Walka pomiędzy nimi bywa dynamiczna i piękna. Drewniane tacki nie tyko przyjaźnią się z piaskiem, ale pozwalają dziecku na:\n• nieskrępowaną twórczość napędzaną siłą wyobraźni,\n• ćwiczenie małych dłoni przed podjęciem trudu nauki pisania,\n• wesołą zabawę ze zmieniającą się fabułą - tak, jak tylko dzieci potrafią,\n• sprawianie nowych przyjemności i wizualnych niespodzianek.\nDrzewo, jeśli napiera na nie piasek, przeciwstawia mu się przybierając niejednokrotnie fantastyczne kształty. Drewno, z którego powstały tacki i piasek będący tworzywem zaprzyjaźnią się z dzieckiem, z jego rączkami i nauczą je piękna.\n• 4 tacki z drewna bukowego o wym. 32 x 23 x 1,5 cm",null,false]
["Aranżacje","F041515-6-08-05","Stół świetlicowy Mila 120 x 80 cm Nr 6 aluminiowy - klon",0,259.89999999999998,"Stoły na stelażu metalowym z okrągłymi nogami. Blaty z płyty laminowanej w tonacji klonu o gr. 18 mm , wykończonej obrzeżem o gr. 2 mm. • wym. blatu 120 x 80 cm • stelaż metalowy z profilu 40 x 20 mm i rury fi 40 mm",null,false]
["Aranżacje","F041515-6-08-08","Stół świetlicowy Mila 120 x 80 cm Nr 6 aluminiowy - buk",0,249.9,"Stóły na stelażu metalowym z nogami okrągłymi. Blaty wykonane z płyty laminowanej o gr. 18 mm, wykończonej obrzeżem o gr. 2 mm.\n • wym. 120 x 80 cm",null,false]
["Stół kreatywny","092788","Blat Flexi okrągły- niebieski",0,559.9,"Blaty wykonane ze sklejki o grubości 25 mm, z kolorowym lamiatem HPL. Rogi blatów delikatnie zaokrąglone. Dwa rodzaje nóg w 7 długościach do wyboru, sprzedawane osobno: nogi okrągłe o śr. 55 mm bez kółek (092790-092797) lub mix- dwie nogi z kółkami i dwie nogi bez kółek (092798-092805). • 5 kształtów: kwadratowy, prostokątny, trapezowy, okrągły, półokrągły • 4 kolory: bukowy, zielony, niebieski, żółty\n• śr. 120 cm",null,false]
{"$rows_left_out":107}
{"sheet":"wybrane produkty - podsumowanie","index":1,"n_rows":282,"n_cols":7,"rows_kept":282,"cut":false,"hidden":false,"merged":[[1,0,1,4],[281,0,281,1],[281,2,281,4],[0,0,0,5]]}
[{"$f":"'lista do wyboru'!A2","v":"Dane placówki:\n"}]
["Wybrane produkty",null,null,null,null,"Wartość całkowita \nwybranych produktów:"]
["Kod","Nazwa","Ilość","Cena\nbrutto","Wartość\nbrutto",{"$f":"SUM(E4:E328)","v":0}]
[{"$f":"IF($G4=\"\",\"--\",INDEX('lista do wyboru'!$B$3:$E$136,$G4,1))","v":"--"},{"$f":"IF($G4=\"\",\"--\",INDEX('lista do wyboru'!$B$3:$E$136,$G4,2))","v":"--"},{"$f":"IF($G4=\"\",\"--\",INDEX('lista do wyboru'!$B$3:$E$136,$G4,3))","v":"--"},{"$f":"IF($G4=\"\",\"--\",INDEX('lista do wyboru'!$B$3:$E$136,$G4,4))","v":"--"},{"$f":"IF(C4 = \"--\",0,D4*C4)","v":0},null,{"$f":"IF(FALSE = ISERROR(MATCH(TRUE,OFFSET('lista do wyboru'!$H$3:$H$136,G3,0),0)),G3+MATCH(TRUE,OFFSET('lista do wyboru'!$H$3:$H$136,G3,0),0),\"\")","v":""}]
[{"$f":"IF($G5=\"\",\"--\",INDEX('lista do wyboru'!$B$3:$E$136,$G5,1))","v":"--"},{"$f":"IF($G5=\"\",\"--\",INDEX('lista do wyboru'!$B$3:$E$136,$G5,2))","v":"--"},{"$f":"IF($G5=\"\",\"--\",INDEX('lista do wyboru'!$B$3:$E$136,$G5,3))","v":"--"},{"$f":"IF($G5=\"\",\"--\",INDEX('lista do wyboru'!$B$3:$E$136,$G5,4))","v":"--"},{"$f":"IF(C5 = \"--\",0,D5*C5)","v":0},null,{"$f":"IF(FALSE = ISERROR(MATCH(TRUE,OFFSET('lista do wyboru'!$H$3:$H$136,G4,0),0)),G4+MATCH(TRUE,OFFSET('lista do wyboru'!$H$3:$H$136,G4,0),0),\"\")","v":""}]
[{"$f":"IF($G6=\"\",\"--\",INDEX('lista do wyboru'!$B$3:$E$136,$G6,1))","v":"--"},{"$f":"IF($G6=\"\",\"--\",INDEX('lista do wyboru'!$B$3:$E$136,$G6,2))","v":"--"},{"$f":"IF($G6=\"\",\"--\",INDEX('lista do wyboru'!$B$3:$E$136,$G6,3))","v":"--"},{"$f":"IF($G6=\"\",\"--\",INDEX('lista do wyboru'!$B$3:$E$136,$G6,4))","v":"--"},0,null,{"$f":"IF(FALSE = ISERROR(MATCH(TRUE,OFFSET('lista do wyboru'!$H$3:$H$136,G5,0),0)),G5+MATCH(TRUE,OFFSET('lista do wyboru'!$H$3:$H$136,G5,0),0),\"\")","v":""}]
[{"$f":"IF($G7=\"\",\"--\",INDEX('lista do wyboru'!$B$3:$E$136,$G7,1))","v":"--"},{"$f":"IF($G7=\"\",\"--\",INDEX('lista do wyboru'!$B$3:$E$136,$G7,2))","v":"--"},{"$f":"IF($G7=\"\",\"--\",INDEX('lista do wyboru'!$B$3:$E$136,$G7,3))","v":"--"},{"$f":"IF($G7=\"\",\"--\",INDEX('lista do wyboru'!$B$3:$E$136,$G7,4))","v":"--"},0,null,{"$f":"IF(FALSE = ISERROR(MATCH(TRUE,OFFSET('lista do wyboru'!$H$3:$H$136,G6,0),0)),G6+MATCH(TRUE,OFFSET('lista do wyboru'!$H$3:$H$136,G6,0),0),\"\")","v":""}]
[{"$f":"IF($G8=\"\",\"--\",INDEX('lista do wyboru'!$B$3:$E$136,$G8,1))","v":"--"},{"$f":"IF($G8=\"\",\"--\",INDEX('lista do wyboru'!$B$3:$E$136,$G8,2))","v":"--"},{"$f":"IF($G8=\"\",\"--\",INDEX('lista do wyboru'!$B$3:$E$136,$G8,3))","v":"--"},{"$f":"IF($G8=\"\",\"--\",INDEX('lista do wyboru'!$B$3:$E$136,$G8,4))","v":"--"},0,null,{"$f":"IF(FALSE = ISERROR(MATCH(TRUE,OFFSET('lista do wyboru'!$H$3:$H$136,G7,0),0)),G7+MATCH(TRUE,OFFSET('lista do wyboru'!$H$3:$H$136,G7,0),0),\"\")","v":""}]
[{"$f":"IF($G9=\"\",\"--\",INDEX('lista do wyboru'!$B$3:$E$136,$G9,1))","v":"--"},{"$f":"IF($G9=\"\",\"--\",INDEX('lista do wyboru'!$B$3:$E$136,$G9,2))","v":"--"},{"$f":"IF($G9=\"\",\"--\",INDEX('lista do wyboru'!$B$3:$E$136,$G9,3))","v":"--"},{"$f":"IF($G9=\"\",\"--\",INDEX('lista do wyboru'!$B$3:$E$136,$G9,4))","v":"--"},0,null,{"$f":"IF(FALSE = ISERROR(MATCH(TRUE,OFFSET('lista do wyboru'!$H$3:$H$136,G8,0),0)),G8+MATCH(TRUE,OFFSET('lista do wyboru'!$H$3:$H$136,G8,0),0),\"\")","v":""}]
[{"$f":"IF($G10=\"\",\"--\",INDEX('lista do wyboru'!$B$3:$E$136,$G10,1))","v":"--"},{"$f":"IF($G10=\"\",\"--\",INDEX('lista do wyboru'!$B$3:$E$136,$G10,2))","v":"--"},{"$f":"IF($G10=\"\",\"--\",INDEX('lista do wyboru'!$B$3:$E$136,$G10,3))","v":"--"},{"$f":"IF($G10=\"\",\"--\",INDEX('lista do wyboru'!$B$3:$E$136,$G10,4))","v":"--"},0,null,{"$f":"IF(FALSE = ISERROR(MATCH(TRUE,OFFSET('lista do wyboru'!$H$3:$H$136,G9,0),0)),G9+MATCH(TRUE,OFFSET('lista do wyboru'!$H$3:$H$136,G9,0),0),\"\")","v":""}]
[{"$f":"IF($G11=\"\",\"--\",INDEX('lista do wyboru'!$B$3:$E$136,$G11,1))","v":"--"},{"$f":"IF($G11=\"\",\"--\",INDEX('lista do wyboru'!$B$3:$E$136,$G11,2))","v":"--"},{"$f":"IF($G11=\"\",\"--\",INDEX('lista do wyboru'!$B$3:$E$136,$G11,3))","v":"--"},{"$f":"IF($G11=\"\",\"--\",INDEX('lista do wyboru'!$B$3:$E$136,$G11,4))","v":"--"},0,null,{"$f":"IF(FALSE = ISERROR(MATCH(TRUE,OFFSET('lista do wyboru'!$H$3:$H$136,G10,0),0)),G10+MATCH(TRUE,OFFSET('lista do wyboru'!$H$3:$H$136,G10,0),0),\"\")","v":""}]
[{"$f":"IF($G12=\"\",\"--\",INDEX('lista do wyboru'!$B$3:$E$136,$G12,1))","v":"--"},{"$f":"IF($G12=\"\",\"--\",INDEX('lista do wyboru'!$B$3:$E$136,$G12,2))","v":"--"},{"$f":"IF($G12=\"\",\"--\",INDEX('lista do wyboru'!$B$3:$E$136,$G12,3))","v":"--"},{"$f":"IF($G12=\"\",\"--\",INDEX('lista do wyboru'!$B$3:$E$136,$G12,4))","v":"--"},0,null,{"$f":"IF(FALSE = ISERROR(MATCH(TRUE,OFFSET('lista do wyboru'!$H$3:$H$136,G11,0),0)),G11+MATCH(TRUE,OFFSET('lista do wyboru'!$H$3:$H$136,G11,0),0),\"\")","v":""}]
[{"$f":"IF($G13=\"\",\"--\",INDEX('lista do wyboru'!$B$3:$E$136,$G13,1))","v":"--"},{"$f":"IF($G13=\"\",\"--\",INDEX('lista do wyboru'!$B$3:$E$136,$G13,2))","v":"--"},{"$f":"IF($G13=\"\",\"--\",INDEX('lista do wyboru'!$B$3:$E$136,$G13,3))","v":"--"},{"$f":"IF($G13=\"\",\"--\",INDEX('lista do wyboru'!$B$3:$E$136,$G13,4))","v":"--"},0,null,{"$f":"IF(FALSE = ISERROR(MATCH(TRUE,OFFSET('lista do wyboru'!$H$3:$H$136,G12,0),0)),G12+MATCH(TRUE,OFFSET('lista do wyboru'!$H$3:$H$136,G12,0),0),\"\")","v":""}]
[{"$f":"IF($G14=\"\",\"--\",INDEX('lista do wyboru'!$B$3:$E$136,$G14,1))","v":"--"},{"$f":"IF($G14=\"\",\"--\",INDEX('lista do wyboru'!$B$3:$E$136,$G14,2))","v":"--"},{"$f":"IF($G14=\"\",\"--\",INDEX('lista do wyboru'!$B$3:$E$136,$G14,3))","v":"--"},{"$f":"IF($G14=\"\",\"--\",INDEX('lista do wyboru'!$B$3:$E$136,$G14,4))","v":"--"},0,null,{"$f":"IF(FALSE = ISERROR(MATCH(TRUE,OFFSET('lista do wyboru'!$H$3:$H$136,G13,0),0)),G13+MATCH(TRUE,OFFSET('lista do wyboru'!$H$3:$H$136,G13,0),0),\"\")","v":""}]
[{"$f":"IF($G15=\"\",\"--\",INDEX('lista do wyboru'!$B$3:$E$136,$G15,1))","v":"--"},{"$f":"IF($G15=\"\",\"--\",INDEX('lista do wyboru'!$B$3:$E$136,$G15,2))","v":"--"},{"$f":"IF($G15=\"\",\"--\",INDEX('lista do wyboru'!$B$3:$E$136,$G15,3))","v":"--"},{"$f":"IF($G15=\"\",\"--\",INDEX('lista do wyboru'!$B$3:$E$136,$G15,4))","v":"--"},0,null,{"$f":"IF(FALSE = ISERROR(MATCH(TRUE,OFFSET('lista do wyboru'!$H$3:$H$136,G14,0),0)),G14+MATCH(TRUE,OFFSET('lista do wyboru'!$H$3:$H$136,G14,0),0),\"\")","v":""}]
[{"$f":"IF($G16=\"\",\"--\",INDEX('lista do wyboru'!$B$3:$E$136,$G16,1))","v":"--"},{"$f":"IF($G16=\"\",\"--\",INDEX('lista do wyboru'!$B$3:$E$136,$G16,2))","v":"--"},{"$f":"IF($G16=\"\",\"--\",INDEX('lista do wyboru'!$B$3:$E$136,$G16,3))","v":"--"},{"$f":"IF($G16=\"\",\"--\",INDEX('lista do wyboru'!$B$3:$E$136,$G16,4))","v":"--"},0,null,{"$f":"IF(FALSE = ISERROR(MATCH(TRUE,OFFSET('lista do wyboru'!$H$3:$H$136,G15,0),0)),G15+MATCH(TRUE,OFFSET('lista do wyboru'!$H$3:$H$136,G15,0),0),\"\")","v":""}]
[{"$f":"IF($G17=\"\",\"--\",INDEX('lista do wyboru'!$B$3:$E$136,$G17,1))","v":"--"},{"$f":"IF($G17=\"\",\"--\",INDEX('lista do wyboru'!$B$3:$E$136,$G17,2))","v":"--"},{"$f":"IF($G17=\"\",\"--\",INDEX('lista do wyboru'!$B$3:$E$136,$G17,3))","v":"--"},{"$f":"IF($G17=\"\",\"--\",INDEX('lista do wyboru'!$B$3:$E$136,$G17,4))","v":"--"},0,null,{"$f":"IF(FALSE = ISERROR(MATCH(TRUE,OFFSET('lista do wyboru'!$H$3:$H$136,G16,0),0)),G16+MATCH(TRUE,OFFSET('lista do wyboru'!$H$3:$H$136,G16,0),0),\"\")","v":""}]
[{"$f":"IF($G18=\"\",\"--\",INDEX('lista do wyboru'!$B$3:$E$136,$G18,1))","v":"--"},{"$f":"IF($G18=\"\",\"--\",INDEX('lista do wyboru'!$B$3:$E$136,$G18,2))","v":"--"},{"$f":"IF($G18=\"\",\"--\",INDEX('lista do wyboru'!$B$3:$E$136,$G18,3))","v":"--"},{"$f":"IF($G18=\"\",\"--\",INDEX('lista do wyboru'!$B$3:$E$136,$G18,4))","v":"--"},0,null,{"$f":"IF(FALSE = ISERROR(MATCH(TRUE,OFFSET('lista do wyboru'!$H$3:$H$136,G17,0),0)),G17+MATCH(TRUE,OFFSET('lista do wyboru'!$H$3:$H$136,G17,0),0),\"\")","v":""}]
[{"$f":"IF($G19=\"\",\"--\",INDEX('lista do wyboru'!$B$3:$E$136,$G19,1))","v":"--"},{"$f":"IF($G19=\"\",\"--\",INDEX('lista do wyboru'!$B$3:$E$136,$G19,2))","v":"--"},{"$f":"IF($G19=\"\",\"--\",INDEX('lista do wyboru'!$B$3:$E$136,$G19,3))","v":"--"},{"$f":"IF($G19=\"\",\"--\",INDEX('lista do wyboru'!$B$3:$E$136,$G19,4))","v":"--"},0,null,{"$f":"IF(FALSE = ISERROR(MATCH(TRUE,OFFSET('lista do wyboru'!$H$3:$H$136,G18,0),0)),G18+MATCH(TRUE,OFFSET('lista do wyboru'!$H$3:$H$136,G18,0),0),\"\")","v":""}]
[{"$f":"IF($G20=\"\",\"--\",INDEX('lista do wyboru'!$B$3:$E$136,$G20,1))","v":"--"},{"$f":"IF($G20=\"\",\"--\",INDEX('lista do wyboru'!$B$3:$E$136,$G20,2))","v":"--"},{"$f":"IF($G20=\"\",\"--\",INDEX('lista do wyboru'!$B$3:$E$136,$G20,3))","v":"--"},{"$f":"IF($G20=\"\",\"--\",INDEX('lista do wyboru'!$B$3:$E$136,$G20,4))","v":"--"},0,null,{"$f":"IF(FALSE = ISERROR(MATCH(TRUE,OFFSET('lista do wyboru'!$H$3:$H$136,G19,0),0)),G19+MATCH(TRUE,OFFSET('lista do wyboru'!$H$3:$H$136,G19,0),0),\"\")","v":""}]
[{"$f":"IF($G21=\"\",\"--\",INDEX('lista do wyboru'!$B$3:$E$136,$G21,1))","v":"--"},{"$f":"IF($G21=\"\",\"--\",INDEX('lista do wyboru'!$B$3:$E$136,$G21,2))","v":"--"},{"$f":"IF($G21=\"\",\"--\",INDEX('lista do wyboru'!$B$3:$E$136,$G21,3))","v":"--"},{"$f":"IF($G21=\"\",\"--\",INDEX('lista do wyboru'!$B$3:$E$136,$G21,4))","v":"--"},0,null,{"$f":"IF(FALSE = ISERROR(MATCH(TRUE,OFFSET('lista do wyboru'!$H$3:$H$136,G20,0),0)),G20+MATCH(TRUE,OFFSET('lista do wyboru'!$H$3:$H$136,G20,0),0),\"\")","v":""}]
[{"$f":"IF($G22=\"\",\"--\",INDEX('lista do wyboru'!$B$3:$E$136,$G22,1))","v":"--"},{"$f":"IF($G22=\"\",\"--\",INDEX('lista do wyboru'!$B$3:$E$136,$G22,2))","v":"--"},{"$f":"IF($G22=\"\",\"--\",INDEX('lista do wyboru'!$B$3:$E$136,$G22,3))","v":"--"},{"$f":"IF($G22=\"\",\"--\",INDEX('lista do wyboru'!$B$3:$E$136,$G22,4))","v":"--"},0,null,{"$f":"IF(FALSE = ISERROR(MATCH(TRUE,OFFSET('lista do wyboru'!$H$3:$H$136,G21,0),0)),G21+MATCH(TRUE,OFFSET('lista do wyboru'!$H$3:$H$136,G21,0),0),\"\")","v":""}]
[{"$f":"IF($G23=\"\",\"--\",INDEX('lista do wyboru'!$B$3:$E$136,$G23,1))","v":"--"},{"$f":"IF($G23=\"\",\"--\",INDEX('lista do wyboru'!$B$3:$E$136,$G23,2))","v":"--"},{"$f":"IF($G23=\"\",\"--\",INDEX('lista do wyboru'!$B$3:$E$136,$G23,3))","v":"--"},{"$f":"IF($G23=\"\",\"--\",INDEX('lista do wyboru'!$B$3:$E$136,$G23,4))","v":"--"},0,null,{"$f":"IF(FALSE = ISERROR(MATCH(TRUE,OFFSET('lista do wyboru'!$H$3:$H$136,G22,0),0)),G22+MATCH(TRUE,OFFSET('lista do wyboru'!$H$3:$H$136,G22,0),0),\"\")","v":""}]
[{"$f":"IF($G24=\"\",\"--\",INDEX('lista do wyboru'!$B$3:$E$136,$G24,1))","v":"--"},{"$f":"IF($G24=\"\",\"--\",INDEX('lista do wyboru'!$B$3:$E$136,$G24,2))","v":"--"},{"$f":"IF($G24=\"\",\"--\",INDEX('lista do wyboru'!$B$3:$E$136,$G24,3))","v":"--"},{"$f":"IF($G24=\"\",\"--\",INDEX('lista do wyboru'!$B$3:$E$136,$G24,4))","v":"--"},0,null,{"$f":"IF(FALSE = ISERROR(MATCH(TRUE,OFFSET('lista do wyboru'!$H$3:$H$136,G23,0),0)),G23+MATCH(TRUE,OFFSET('lista do wyboru'!$H$3:$H$136,G23,0),0),\"\")","v":""}]
[{"$f":"IF($G25=\"\",\"--\",INDEX('lista do wyboru'!$B$3:$E$136,$G25,1))","v":"--"},{"$f":"IF($G25=\"\",\"--\",INDEX('lista do wyboru'!$B$3:$E$136,$G25,2))","v":"--"},{"$f":"IF($G25=\"\",\"--\",INDEX('lista do wyboru'!$B$3:$E$136,$G25,3))","v":"--"},{"$f":"IF($G25=\"\",\"--\",INDEX('lista do wyboru'!$B$3:$E$136,$G25,4))","v":"--"},0,null,{"$f":"IF(FALSE = ISERROR(MATCH(TRUE,OFFSET('lista do wyboru'!$H$3:$H$136,G24,0),0)),G24+MATCH(TRUE,OFFSET('lista do wyboru'!$H$3:$H$136,G24,0),0),\"\")","v":""}]
[{"$f":"IF($G26=\"\",\"--\",INDEX('lista do wyboru'!$B$3:$E$136,$G26,1))","v":"--"},{"$f":"IF($G26=\"\",\"--\",INDEX('lista do wyboru'!$B$3:$E$136,$G26,2))","v":"--"},{"$f":"IF($G26=\"\",\"--\",INDEX('lista do wyboru'!$B$3:$E$136,$G26,3))","v":"--"},{"$f":"IF($G26=\"\",\"--\",INDEX('lista do wyboru'!$B$3:$E$136,$G26,4))","v":"--"},0,null,{"$f":"IF(FALSE = ISERROR(MATCH(TRUE,OFFSET('lista do wyboru'!$H$3:$H$136,G25,0),0)),G25+MATCH(TRUE,OFFSET('lista do wyboru'!$H$3:$H$136,G25,0),0),\"\")","v":""}]
[{"$f":"IF($G27=\"\",\"--\",INDEX('lista do wyboru'!$B$3:$E$136,$G27,1))","v":"--"},{"$f":"IF($G27=\"\",\"--\",INDEX('lista do wyboru'!$B$3:$E$136,$G27,2))","v":"--"},{"$f":"IF($G27=\"\",\"--\",INDEX('lista do wyboru'!$B$3:$E$136,$G27,3))","v":"--"},{"$f":"IF($G27=\"\",\"--\",INDEX('lista do wyboru'!$B$3:$E$136,$G27,4))","v":"--"},0,null,{"$f":"IF(FALSE = ISERROR(MATCH(TRUE,OFFSET('lista do wyboru'!$H$3:$H$136,G26,0),0)),G26+MATCH(TRUE,OFFSET('lista do wyboru'!$H$3:$H$136,G26,0),0),\"\")","v":""}]
[{"$f":"IF($G28=\"\",\"--\",INDEX('lista do wyboru'!$B$3:$E$136,$G28,1))","v":"--"},{"$f":"IF($G28=\"\",\"--\",INDEX('lista do wyboru'!$B$3:$E$136,$G28,2))","v":"--"},{"$f":"IF($G28=\"\",\"--\",INDEX('lista do wyboru'!$B$3:$E$136,$G28,3))","v":"--"},{"$f":"IF($G28=\"\",\"--\",INDEX('lista do wyboru'!$B$3:$E$136,$G28,4))","v":"--"},0,null,{"$f":"IF(FALSE = ISERROR(MATCH(TRUE,OFFSET('lista do wyboru'!$H$3:$H$136,G27,0),0)),G27+MATCH(TRUE,OFFSET('lista do wyboru'!$H$3:$H$136,G27,0),0),\"\")","v":""}]
[{"$f":"IF($G29=\"\",\"--\",INDEX('lista do wyboru'!$B$3:$E$136,$G29,1))","v":"--"},{"$f":"IF($G29=\"\",\"--\",INDEX('lista do wyboru'!$B$3:$E$136,$G29,2))","v":"--"},{"$f":"IF($G29=\"\",\"--\",INDEX('lista do wyboru'!$B$3:$E$136,$G29,3))","v":"--"},{"$f":"IF($G29=\"\",\"--\",INDEX('lista do wyboru'!$B$3:$E$136,$G29,4))","v":"--"},0,null,{"$f":"IF(FALSE = ISERROR(MATCH(TRUE,OFFSET('lista do wyboru'!$H$3:$H$136,G28,0),0)),G28+MATCH(TRUE,OFFSET('lista do wyboru'!$H$3:$H$136,G28,0),0),\"\")","v":""}]
[{"$f":"IF($G30=\"\",\"--\",INDEX('lista do wyboru'!$B$3:$E$136,$G30,1))","v":"--"},{"$f":"IF($G30=\"\",\"--\",INDEX('lista do wyboru'!$B$3:$E$136,$G30,2))","v":"--"},{"$f":"IF($G30=\"\",\"--\",INDEX('lista do wyboru'!$B$3:$E$136,$G30,3))","v":"--"},{"$f":"IF($G30=\"\",\"--\",INDEX('lista do wyboru'!$B$3:$E$136,$G30,4))","v":"--"},0,null,{"$f":"IF(FALSE = ISERROR(MATCH(TRUE,OFFSET('lista do wyboru'!$H$3:$H$136,G29,0),0)),G29+MATCH(TRUE,OFFSET('lista do wyboru'!$H$3:$H$136,G29,0),0),\"\")","v":""}]
{"$rows_left_out":253}
{"sheet":"Arkusz2","index":2,"n_rows":7,"n_cols":1,"rows_kept":7,"cut":false,"hidden":true,"merged":[]}
["Wszystkie"]
["Aranżacje"]
["Doświadczenia"]
["Integrancja sensoryczna"]
["Moje Bambino"]
["Multimedia"]
["Stół kreatywny"]